Target
Mitogen-activated protein kinase 14
Ligand
BDBM17730
Substrate
biotinylated GST-ATF2
Meas. Tech.
HTRF Kinase Inhibition Assay
IC50
200±n/a nM
Citation
 Martin, MWNewcomb, JNunes, JJMcGowan, DCArmistead, DMBoucher, CBuchanan, JLBuckner, WChai, LElbaum, DEpstein, LFFaust, TFlynn, SGallant, PGore, AGu, YHsieh, FHuang, XLee, JHMetz, DMiddleton, SMohn, DMorgenstern, KMorrison, MJNovak, PMOliveira-dos-Santos, APowers, DRose, PSchneider, SSell, STudor, YTurci, SMWelcher, AAWhite, RDZack, DZhao, HZhu, LZhu, XGhiron, CAmouzegh, PErmann, MJenkins, JJohnston, DNapier, SPower, E Novel 2-aminopyrimidine carbamates as potent and orally active inhibitors of Lck: synthesis, SAR, and in vivo antiinflammatory activity. J Med Chem 49:4981-91 (2006)  
Target
Name:
Mitogen-activated protein kinase 14
Synonyms:
CSAID-binding protein CSBP1 CSPB1 MAP kinase 14 MAP kinase p38 alpha MAPK14 MK14_HUMAN Mitogen-activated protein kinase p38 alpha Stress-activated protein kinase 2a | p38 MAP kinase alpha/beta
Type:
Serine/threonine-protein kinase
Mol. Mass.:
41286.76
Organism:
Homo sapiens (Human)
Description:
Q16539
Residue:
360
  
Inhibitor
Name:
BDBM17730
Synonyms:
2,6-dimethylphenyl N-[(2,5-dimethoxyphenyl)methyl]-N-(2-{[4-(4-methylpiperazin-1-yl)phenyl]amino}pyrimidin-4-yl)carbamate | 2-aminopyrimidine carbamate, 29
Type:
Small organic molecule
Emp. Form.:
C33H38N6O4
Mol. Mass.:
582.6926
SMILES:
COc1ccc(OC)c(CN(C(=O)Oc2c(C)cccc2C)c2ccnc(Nc3ccc(cc3)N3CCN(C)CC3)n2)c1
:
Substrate
Name:
biotinylated GST-ATF2
Synonyms:
ATF-2-GST Activating transcription factor 2 GST-ATF2 biotinylated activating transcription factor 2
Type:
Other Protein Type
Mol. Mass.:
12237.77
Organism:
Homo sapiens (Human)
Description:
Residue:
109