Target
Vascular endothelial growth factor receptor 2
Ligand
BDBM17730
Substrate
Gastrin Peptide Substrate
Meas. Tech.
HTRF Kinase Inhibition Assay
IC50
200±n/a nM
Citation
 Martin, MWNewcomb, JNunes, JJMcGowan, DCArmistead, DMBoucher, CBuchanan, JLBuckner, WChai, LElbaum, DEpstein, LFFaust, TFlynn, SGallant, PGore, AGu, YHsieh, FHuang, XLee, JHMetz, DMiddleton, SMohn, DMorgenstern, KMorrison, MJNovak, PMOliveira-dos-Santos, APowers, DRose, PSchneider, SSell, STudor, YTurci, SMWelcher, AAWhite, RDZack, DZhao, HZhu, LZhu, XGhiron, CAmouzegh, PErmann, MJenkins, JJohnston, DNapier, SPower, E Novel 2-aminopyrimidine carbamates as potent and orally active inhibitors of Lck: synthesis, SAR, and in vivo antiinflammatory activity. J Med Chem 49:4981-91 (2006)  
Target
Name:
Vascular endothelial growth factor receptor 2
Synonyms:
CD_antigen=CD309 Fetal liver kinase 1 (FLK-1) KDR Protein-tyrosine kinase receptor Flk-1 VEGFR-2 VEGFR2 Vascular Endothelial Growth Factor Receptor Kinase 2 Vascular endothelial growth factor receptor 2 (KDR) Vascular endothelial growth factor receptor 2 (VEGFR2) Vascular endothelial growth factor receptor-2 (VEGFR-2)
Type:
Receptor Tyrosine Kinase
Mol. Mass.:
151510.97
Organism:
Homo sapiens (Human)
Description:
P35968
Residue:
1356
  
Inhibitor
Name:
BDBM17730
Synonyms:
2,6-dimethylphenyl N-[(2,5-dimethoxyphenyl)methyl]-N-(2-{[4-(4-methylpiperazin-1-yl)phenyl]amino}pyrimidin-4-yl)carbamate | 2-aminopyrimidine carbamate, 29
Type:
Small organic molecule
Emp. Form.:
C33H38N6O4
Mol. Mass.:
582.6926
SMILES:
COc1ccc(OC)c(CN(C(=O)Oc2c(C)cccc2C)c2ccnc(Nc3ccc(cc3)N3CCN(C)CC3)n2)c1
:
Substrate
Name:
Gastrin Peptide Substrate
Synonyms:
Biotinylated gastrin peptide substrate gastrin substrate
Type:
Peptide
Mol. Mass.:
1823.88
Organism:
Description:
Residue:
15
ITINEEEEAYGWLDF