Target
Histone deacetylase 4
Ligand
BDBM19130
Substrate
BDBM19150
Meas. Tech.
HDAC Enzyme Activity Assay
pH
8±n/a
Temperature
310.15±n/a K
IC50
20±n/a nM
Citation
 Bhuiyan, MPKato, TOkauchi, TNishino, NMaeda, SNishino, TGYoshida, M Chlamydocin analogs bearing carbonyl group as possible ligand toward zinc atom in histone deacetylases. Bioorg Med Chem 14:3438-46 (2006)  
Target
Name:
Histone deacetylase 4
Synonyms:
Cereblon/Histone deacetylase 4 HDAC4 Histone acetylase 4(HDAC4) KIAA0288
Type:
Enzyme
Mol. Mass.:
119049.39
Organism:
Homo sapiens (Human)
Description:
P56524
Residue:
1084
  
Inhibitor
Name:
BDBM19130
Synonyms:
(2E,4E,6R)-7-[4-(dimethylamino)phenyl]-N-hydroxy-4,6-dimethyl-7-oxohepta-2,4-dienamide TSA | Trichostatin A (TSA)
Type:
Small organic molecule
Emp. Form.:
C17H22N2O3
Mol. Mass.:
302.3682
SMILES:
CC(C=CC(=O)NO)C=C(C)C(=O)c1ccc(cc1)N(C)C
:
Substrate
Name:
BDBM19150
Synonyms:
Ac-Arg-Gly-Lys(Ac)-AMC | Ac-KGLGK(Ac)-AMC
Type:
Fluorescent Peptide
Emp. Form.:
C28H40N8O7
Mol. Mass.:
600.6666
SMILES:
[#6]-[#6](=O)-[#7]-[#6]-[#6]-[#6]-[#6]-[#6@H](-[#7]-[#6](=O)-[#6]-[#7]-[#6](=O)-[#6@H](-[#6]-[#6]-[#6]\[#7]=[#6](\[#7])-[#7])-[#7]-[#6](-[#6])=O)-[#6](=O)-[#7]-c1ccc2c(-[#6])cc(=O)oc2c1
: