Target
Indoleamine 2,3-dioxygenase 1
Ligand
BDBM387586
Substrate
Meas. Tech.
In-vitro IDO1 Enzyme (Indoleamine 2,3-dioxygenase) Assay
IC50
<200±n/a nM
Citation
 Banerjee, MMiddya, SShrivastava, RRaina, SSurya, AYadav, DBYadav, VKKapoor, KKVenkatesan, ASmith, RAThompson, SK Inhibitors of the kynurenine pathway US Patent  US10294212 Publication Date 5/21/2019 
Target
Name:
Indoleamine 2,3-dioxygenase 1
Synonyms:
I23O1_HUMAN IDO-1 INDO Indoleamine 2,3-dioxygenase | Indoleamine-pyrrole 2,3-dioxygenase
Type:
Enzyme
Mol. Mass.:
45330.80
Organism:
Homo sapiens (Human)
Description:
P14902
Residue:
403
  
Inhibitor
Name:
BDBM387586
Synonyms:
5-Chloro-N3- (3-chloro-4- fluorophenyl) furo[2,3-c] pyridine-2,3- diamine | US10294212, No. 177
Type:
Small organic molecule
Emp. Form.:
C13H8Cl2FN3O
Mol. Mass.:
312.127
SMILES:
Nc1oc2cnc(Cl)cc2c1Nc1ccc(F)c(Cl)c1
: