Target
Indoleamine 2,3-dioxygenase 1
Ligand
BDBM387614
Substrate
Meas. Tech.
In-vitro IDO1 Enzyme (Indoleamine 2,3-dioxygenase) Assay
IC50
<200±n/a nM
Citation
 Banerjee, MMiddya, SShrivastava, RRaina, SSurya, AYadav, DBYadav, VKKapoor, KKVenkatesan, ASmith, RAThompson, SK Inhibitors of the kynurenine pathway US Patent  US10294212 Publication Date 5/21/2019 
Target
Name:
Indoleamine 2,3-dioxygenase 1
Synonyms:
I23O1_HUMAN IDO-1 INDO Indoleamine 2,3-dioxygenase | Indoleamine-pyrrole 2,3-dioxygenase
Type:
Enzyme
Mol. Mass.:
45330.80
Organism:
Homo sapiens (Human)
Description:
P14902
Residue:
403
  
Inhibitor
Name:
BDBM387614
Synonyms:
N3-(3,4- Difluoro- phenyl)-7-(2- methylpyridin- 4-yl)furo[2,3- c]pyridine-2,3- diamine | US10294212, No. 198
Type:
Small organic molecule
Emp. Form.:
C19H14F2N4O
Mol. Mass.:
352.3375
SMILES:
Cc1cc(ccn1)-c1nccc2c(Nc3ccc(F)c(F)c3)c(N)oc12
: