Target
Indoleamine 2,3-dioxygenase 1
Ligand
BDBM387646
Substrate
Meas. Tech.
In-vitro IDO1 Enzyme (Indoleamine 2,3-dioxygenase) Assay
IC50
<200±n/a nM
Citation
 Banerjee, MMiddya, SShrivastava, RRaina, SSurya, AYadav, DBYadav, VKKapoor, KKVenkatesan, ASmith, RAThompson, SK Inhibitors of the kynurenine pathway US Patent  US10294212 Publication Date 5/21/2019 
Target
Name:
Indoleamine 2,3-dioxygenase 1
Synonyms:
I23O1_HUMAN IDO-1 INDO Indoleamine 2,3-dioxygenase | Indoleamine-pyrrole 2,3-dioxygenase
Type:
Enzyme
Mol. Mass.:
45330.80
Organism:
Homo sapiens (Human)
Description:
P14902
Residue:
403
  
Inhibitor
Name:
BDBM387646
Synonyms:
4-(2-amino-3- ((4-fluoro-3- (trifluoro- methyl)phenyl) amino)furo [2,3-c]pyridin- 7-yl)-N- methyl- picolinamide | US10294212, No. 227
Type:
Small organic molecule
Emp. Form.:
C21H15F4N5O2
Mol. Mass.:
445.3697
SMILES:
CNC(=O)c1cc(ccn1)-c1nccc2c(Nc3ccc(F)c(c3)C(F)(F)F)c(N)oc12
: