Target
Tyrosine-protein kinase ITK/TSK
Ligand
BDBM26845
Substrate
poly Glu4: Tyr
Meas. Tech.
Dissociation Enhanced Lanthanide Fluoroimmunoassay (DELFIA)
IC50
11±n/a nM
Citation
 Cook, BNBentzien, JWhite, ANemoto, PAWang, JMan, CCSoleymanzadeh, FKhine, HHKashem, MAKugler, SZWolak, JPRoth, GPDe Lombaert, SPullen, SSTakahashi, H Discovery of potent inhibitors of interleukin-2 inducible T-cell kinase (ITK) through structure-based drug design. Bioorg Med Chem Lett 19:773-7 (2009)  
Target
Name:
Tyrosine-protein kinase ITK/TSK
Synonyms:
EMT ITK_HUMAN LYK Tyrosine-protein kinase ITK Tyrosine-protein kinase Lyk
Type:
Protein
Mol. Mass.:
71839.20
Organism:
Homo sapiens (Human)
Description:
Q08881
Residue:
620
  
Inhibitor
Name:
BDBM26845
Synonyms:
N-[(2E)-5-[benzene(methyl)amido]-1-(2-carbamoylethyl)-2,3-dihydro-1H-1,3-benzodiazol-2-ylidene]-5-(1,3-thiazol-2-yl)thiophene-2-carboxamide | acylated 2-aminobenzimidazole, 39
Type:
Small organic molecule
Emp. Form.:
C26H22N6O3S2
Mol. Mass.:
530.621
SMILES:
CN(C(=O)c1ccccc1)c1ccc2n(CCC(N)=O)c(NC(=O)c3ccc(s3)-c3nccs3)nc2c1
:
Substrate
Name:
poly Glu4: Tyr
Synonyms:
PGTYR-biotin
Type:
Random copolymer
Mol. Mass.:
358.43
Organism:
Description:
Residue:
3
NA