Target
Muscarinic acetylcholine receptor M3
Ligand
BDBM50249403
Substrate
Meas. Tech.
ChEBML_1679926
EC50
>30000±n/a nM
Citation
 Melancon, BJWood, MRNoetzel, MJNance, KDEngelberg, EMHan, CLamsal, AChang, SCho, HPByers, FWBubser, MJones, CKNiswender, CMWood, MWEngers, DWWu, DBrandon, NJDuggan, MEConn, PJBridges, TMLindsley, CW Optimization of M Bioorg Med Chem Lett 27:2296-2301 (2017)  
Target
Name:
Muscarinic acetylcholine receptor M3
Synonyms:
ACM3_RAT Chrm-3 | Chrm3
Type:
Enzyme Catalytic Domain
Mol. Mass.:
66086.66
Organism:
RAT
Description:
Cholinergic, muscarinic M3 CHRM3 RAT::P08483
Residue:
589
  
Inhibitor
Name:
BDBM50249403
Synonyms:
CHEMBL4091821
Type:
Small organic molecule
Emp. Form.:
C21H18FN5OS
Mol. Mass.:
407.464
SMILES:
Cc1nnc2sc(C(=O)NCc3ccc(cc3)-c3cccnc3F)c(N)c2c1C
: