Target
Sphingosine kinase 1
Ligand
BDBM50393642
Substrate
Meas. Tech.
ChEBML_1683748
IC50
>100000±n/a nM
Citation
 Ohno, HHonda, MHamada, NMiyagaki, JIwata, AOtsuki, KMaruyama, TNakamura, SNakanishi, IInuki, SFujii, NOishi, S Identification of selective inhibitors of sphingosine kinases 1 and 2 through a structure-activity relationship study of 4-epi-jaspine B. Bioorg Med Chem 25:3046-3052 (2017)  
Target
Name:
Sphingosine kinase 1
Synonyms:
SK1 SPHK1 SPK Sphingosine kinase 1 (SPHK1) | Sphingosine kinase types 1 (SphK1)
Type:
Enzyme
Mol. Mass.:
42521.16
Organism:
Homo sapiens (Human)
Description:
Q9NYA1
Residue:
384
  
Inhibitor
Name:
BDBM50393642
Synonyms:
CHEMBL2158685
Type:
Small organic molecule
Emp. Form.:
C23H25ClN2O
Mol. Mass.:
380.91
SMILES:
Clc1ccc(cc1)C12CC3CC(CC(C3)(C1)C(=O)NCc1ccncc1)C2
: