Target
Sphingosine kinase 2
Ligand
BDBM174110
Substrate
Meas. Tech.
ChEMBL_1683759 (CHEMBL4034238)
Ki
1200±n/a nM
Citation
 Ohno, HHonda, MHamada, NMiyagaki, JIwata, AOtsuki, KMaruyama, TNakamura, SNakanishi, IInuki, SFujii, NOishi, S Identification of selective inhibitors of sphingosine kinases 1 and 2 through a structure-activity relationship study of 4-epi-jaspine B. Bioorg Med Chem 25:3046-3052 (2017)  
Target
Name:
Sphingosine kinase 2
Synonyms:
SK 2 SPHK2 SPK 2 Sphingosine kinase types 2 (SphK2)
Type:
Protein
Mol. Mass.:
69221.44
Organism:
Homo sapiens (Human)
Description:
Q9NRA0
Residue:
654
  
Inhibitor
Name:
BDBM174110
Synonyms:
(S)-2-(3-(4-octylphenyl)-1,2,4- oxadiazol-5-yl)azetidine-1- carboximidamide
Type:
Small organic molecule
Emp. Form.:
C20H29N5O
Mol. Mass.:
355.4772
SMILES:
CCCCCCCCc1ccc(cc1)-c1noc(n1)[C@@H]1CCN1C(N)=N
: