Target
Carbonic anhydrase 12
Ligand
BDBM50271185
Substrate
Meas. Tech.
ChEMBL_1709747 (CHEMBL4119796)
Ki
38.0±n/a nM
Citation
 Bianco, GMeleddu, RDistinto, SCottiglia, FGaspari, MMelis, CCorona, AAngius, RAngeli, ATaverna, DAlcaro, SLeitans, JKazaks, ATars, KSupuran, CTMaccioni, E -Acylbenzenesulfonamide Dihydro-1,3,4-oxadiazole Hybrids: Seeking Selectivity toward Carbonic Anhydrase Isoforms. ACS Med Chem Lett 8:792-796 (2017)  
Target
Name:
Carbonic anhydrase 12
Synonyms:
CA-XII CAH12_HUMAN Carbonic anhydrase Carbonic anhydrase XII Carbonic anhydrase XII (CAXII) | Tumor antigen HOM-RCC-3.1.3
Type:
Enzyme
Mol. Mass.:
39456.00
Organism:
Homo sapiens (Human)
Description:
Catalytic domain of human cloned isozyme was used in the assay
Residue:
354
  
Inhibitor
Name:
BDBM50271185
Synonyms:
CHEMBL4128942
Type:
Small organic molecule
Emp. Form.:
C18H15Cl2N3O5S
Mol. Mass.:
456.3
SMILES:
CC(=O)NS(=O)(=O)c1ccc(cc1)C1=NN(C(O1)c1ccc(Cl)cc1Cl)C(C)=O
: