Target
Carbonic anhydrase 9
Ligand
BDBM50271185
Substrate
Meas. Tech.
ChEMBL_1709746 (CHEMBL4119795)
Ki
24±n/a nM
Citation
 Bianco, GMeleddu, RDistinto, SCottiglia, FGaspari, MMelis, CCorona, AAngius, RAngeli, ATaverna, DAlcaro, SLeitans, JKazaks, ATars, KSupuran, CTMaccioni, E -Acylbenzenesulfonamide Dihydro-1,3,4-oxadiazole Hybrids: Seeking Selectivity toward Carbonic Anhydrase Isoforms. ACS Med Chem Lett 8:792-796 (2017)  
Target
Name:
Carbonic anhydrase 9
Synonyms:
CA-IX CAH9_HUMAN Carbonic anhydrase 9 (CA IX) Carbonic anhydrase 9 precursor Carbonic anhydrase IX (CAIX) Carbonic anhydrases; II & IX MN RCC-associated antigen G250
Type:
Enzyme
Mol. Mass.:
49669.03
Organism:
Homo sapiens (Human)
Description:
Catalytic domain of human cloned isozyme was used in the assay
Residue:
459
  
Inhibitor
Name:
BDBM50271185
Synonyms:
CHEMBL4128942
Type:
Small organic molecule
Emp. Form.:
C18H15Cl2N3O5S
Mol. Mass.:
456.3
SMILES:
CC(=O)NS(=O)(=O)c1ccc(cc1)C1=NN(C(O1)c1ccc(Cl)cc1Cl)C(C)=O
: