Target
Carbonic anhydrase 2
Ligand
BDBM50271195
Substrate
Meas. Tech.
ChEMBL_1709745 (CHEMBL4119794)
Ki
158±n/a nM
Citation
 Bianco, GMeleddu, RDistinto, SCottiglia, FGaspari, MMelis, CCorona, AAngius, RAngeli, ATaverna, DAlcaro, SLeitans, JKazaks, ATars, KSupuran, CTMaccioni, E -Acylbenzenesulfonamide Dihydro-1,3,4-oxadiazole Hybrids: Seeking Selectivity toward Carbonic Anhydrase Isoforms. ACS Med Chem Lett 8:792-796 (2017)  
Target
Name:
Carbonic anhydrase 2
Synonyms:
CA-II CAC Carbonate dehydratase II Carbonic anhydrase 2 (CA-II) Carbonic anhydrase C Carbonic anhydrase II (CA-II) Carbonic anhydrase II (hCA II) | Carbonic anhydrase isoenzyme II (hCA II)
Type:
Enzyme
Mol. Mass.:
29250.71
Organism:
Homo sapiens (Human)
Description:
P00918
Residue:
260
  
Inhibitor
Name:
BDBM50271195
Synonyms:
CHEMBL4127781
Type:
Small organic molecule
Emp. Form.:
C18H16N4O7S
Mol. Mass.:
432.407
SMILES:
CC(=O)NS(=O)(=O)c1ccc(cc1)C1=NN(C(O1)c1ccc(cc1)[N+]([O-])=O)C(C)=O
: