Target
Integrin alpha-5/beta-1
Ligand
BDBM50287726
Substrate
Meas. Tech.
ChEMBL_1729766 (CHEMBL4145044)
IC50
22±n/a nM
Citation
 Merlino, FDaniele, SLa Pietra, VDi Maro, SDi Leva, FSBrancaccio, DTomassi, SGiuntini, SCerofolini, LFragai, MLuchinat, CReichart, FCavallini, CCosta, BPiccarducci, RTaliani, SDa Settimo, FMartini, CKessler, HNovellino, EMarinelli, L Simultaneous Targeting of RGD-Integrins and Dual Murine Double Minute Proteins in Glioblastoma Multiforme. J Med Chem 61:4791-4809 (2018)  
Target
Name:
Integrin alpha-5/beta-1
Synonyms:
Fibronectin receptor alpha/beta ITGA5/ITGB1
Type:
Enzyme
Mol. Mass.:
Description:
Components:
This complex has 2 components.
Component 1
Name:
Integrin alpha-5
Synonyms:
CD49 antigen-like family member E FNRA Fibronectin receptor subunit alpha ITGA5 Integrin alpha-F | VLA-5
Type:
Single-pass type I membrane protein
Mol. Mass.:
114523.00
Organism:
Homo sapiens (Human)
Description:
Residue:
1049
  
Component 2
Name:
Integrin beta-1
Synonyms:
CD_antigen=CD29 Fibronectin receptor beta GPIIA ITGB1 MDF2 | MSK12
Type:
Enzyme
Mol. Mass.:
88400.38
Organism:
Homo sapiens (Human)
Description:
P05556
Residue:
798
  
Inhibitor
Name:
BDBM50287726
Synonyms:
CHEMBL4177354
Type:
Small organic molecule
Emp. Form.:
C28H30N6O5
Mol. Mass.:
530.575
SMILES:
NC(=N)Nc1cccc(c1)C(=O)NCC(=O)N[C@@H](CC(O)=O)C(=O)NCC(c1ccccc1)c1ccccc1
: