Target
Integrin alpha-5/beta-1
Ligand
BDBM50287989
Substrate
Meas. Tech.
ChEMBL_1729766 (CHEMBL4145044)
IC50
20±n/a nM
Citation
 Merlino, FDaniele, SLa Pietra, VDi Maro, SDi Leva, FSBrancaccio, DTomassi, SGiuntini, SCerofolini, LFragai, MLuchinat, CReichart, FCavallini, CCosta, BPiccarducci, RTaliani, SDa Settimo, FMartini, CKessler, HNovellino, EMarinelli, L Simultaneous Targeting of RGD-Integrins and Dual Murine Double Minute Proteins in Glioblastoma Multiforme. J Med Chem 61:4791-4809 (2018)  
Target
Name:
Integrin alpha-5/beta-1
Synonyms:
Fibronectin receptor alpha/beta ITGA5/ITGB1
Type:
Enzyme
Mol. Mass.:
Description:
Components:
This complex has 2 components.
Component 1
Name:
Integrin alpha-5
Synonyms:
CD49 antigen-like family member E FNRA Fibronectin receptor subunit alpha ITGA5 Integrin alpha-F | VLA-5
Type:
Single-pass type I membrane protein
Mol. Mass.:
114523.00
Organism:
Homo sapiens (Human)
Description:
Residue:
1049
  
Component 2
Name:
Integrin beta-1
Synonyms:
CD_antigen=CD29 Fibronectin receptor beta GPIIA ITGB1 MDF2 | MSK12
Type:
Enzyme
Mol. Mass.:
88400.38
Organism:
Homo sapiens (Human)
Description:
P05556
Residue:
798
  
Inhibitor
Name:
BDBM50287989
Synonyms:
CHEMBL4173588
Type:
Small organic molecule
Emp. Form.:
C22H26N6O5
Mol. Mass.:
454.479
SMILES:
C[C@H](NC(=O)[C@H](CC(O)=O)NC(=O)CNC(=O)c1cccc(NC(N)=N)c1)c1ccccc1
: