Target
Mitogen-activated protein kinase 1
Ligand
BDBM50456348
Substrate
Meas. Tech.
ChEMBL_1755344 (CHEMBL4190104)
IC50
3.0±n/a nM
Citation
 Heightman, TDBerdini, VBraithwaite, HBuck, IMCassidy, MCastro, JCourtin, ADay, JEHEast, CFazal, LGraham, BGriffiths-Jones, CMLyons, JFMartins, VMuench, SMunck, JMNorton, DO'Reilly, MPalmer, NPathuri, PReader, MRees, DCRich, SJRichardson, CSaini, HThompson, NTWallis, NGWalton, HWilsher, NEWoolford, AJCooke, MCousin, DOnions, SShannon, JWatts, JMurray, CW Fragment-Based Discovery of a Potent, Orally Bioavailable Inhibitor That Modulates the Phosphorylation and Catalytic Activity of ERK1/2. J Med Chem 61:4978-4992 (2018)  
Target
Name:
Mitogen-activated protein kinase 1
Synonyms:
ERK2 Extracellular signal-regulated kinase 2 Extracellular signal-regulated kinase 2 (ERK2) MAPK 2 MK01_HUMAN Mitogen-activated protein kinase 1 (ERK-2) Mitogen-activated protein kinase 2 PRKM2 | p42-MAPK
Type:
Ser/Thr Protein Kinase
Mol. Mass.:
41392.76
Organism:
Homo sapiens (Human)
Description:
P28482
Residue:
360
  
Inhibitor
Name:
BDBM50456348
Synonyms:
CHEMBL4212211 | US11001575, Example 683
Type:
Small organic molecule
Emp. Form.:
C29H32ClN5O4
Mol. Mass.:
550.048
SMILES:
C[C@@H](N1Cc2ccc(cc2C1=O)-c1nc(NC2CCOCC2)ncc1Cl)C(=O)N[C@H](CO)c1cccc(C)c1
: