Target
Tyrosine-protein kinase ABL1
Ligand
BDBM50328152
Substrate
Meas. Tech.
ChEMBL_1765488 (CHEMBL4200735)
IC50
>10000±n/a nM
Citation
 Schoepfer, JJahnke, WBerellini, GBuonamici, SCotesta, SCowan-Jacob, SWDodd, SDrueckes, PFabbro, DGabriel, TGroell, JMGrotzfeld, RMHassan, AQHenry, CIyer, VJones, DLombardo, FLoo, AManley, PWPellé, XRummel, GSalem, BWarmuth, MWylie, AAZoller, TMarzinzik, ALFuret, P Discovery of Asciminib (ABL001), an Allosteric Inhibitor of the Tyrosine Kinase Activity of BCR-ABL1. J Med Chem 61:8120-8135 (2018)  
Target
Name:
Tyrosine-protein kinase ABL1
Synonyms:
ABL ABL1_HUMAN JTK7 Proto-oncogene tyrosine-protein kinase ABL1 Tyrosine-protein kinase ABL V-abl Abelson murine leukemia viral oncogene homolog 1 p150 | tyrosine-protein kinase ABL1 isoform a
Type:
Enzyme
Mol. Mass.:
122897.30
Organism:
Homo sapiens (Human)
Description:
P00519
Residue:
1130
  
Inhibitor
Name:
BDBM50328152
Synonyms:
CHEMBL1257423 US11649218, Example GNF-5
Type:
Small organic molecule
Emp. Form.:
C20H17F3N4O3
Mol. Mass.:
418.3692
SMILES:
OCCNC(=O)c1cccc(c1)-c1cc(Nc2ccc(OC(F)(F)F)cc2)ncn1
: