Target
Sterol 14-alpha demethylase
Ligand
BDBM50465949
Substrate
Meas. Tech.
ChEMBL_1789366 (CHEMBL4261100)
Kd
8.4±n/a nM
Citation
 Friggeri, LHargrove, TYRachakonda, GBlobaum, ALFisher, Pde Oliveira, GMda Silva, CFSoeiro, MNCNes, WDLindsley, CWVillalta, FGuengerich, FPLepesheva, GI Sterol 14?-Demethylase Structure-Based Optimization of Drug Candidates for Human Infections with the Protozoan Trypanosomatidae. J Med Chem 61:10910-10921 (2018)  
Target
Name:
Sterol 14-alpha demethylase
Synonyms:
CP51_TRYCC Cytochrome P450 51 Sterol 14α-demethylase (CYP51) Sterol 14-alpha demethylase (CYP51) | Tc14DM
Type:
Protein
Mol. Mass.:
54690.12
Organism:
Trypanosoma cruzi
Description:
Q7Z1V1
Residue:
481
  
Inhibitor
Name:
BDBM50465949
Synonyms:
CHEMBL4276822
Type:
Small organic molecule
Emp. Form.:
C32H22F3N5O2
Mol. Mass.:
565.5446
SMILES:
Fc1ccc(cc1)-c1cc(F)c([C@H](Cn2ccnc2)NC(=O)c2ccc(cc2)-c2nnc(o2)-c2ccccc2)c(F)c1
: