Target
Sterol 14-alpha demethylase
Ligand
BDBM50276214
Substrate
Meas. Tech.
ChEMBL_1789366 (CHEMBL4261100)
Kd
4.2±n/a nM
Citation
 Friggeri, LHargrove, TYRachakonda, GBlobaum, ALFisher, Pde Oliveira, GMda Silva, CFSoeiro, MNCNes, WDLindsley, CWVillalta, FGuengerich, FPLepesheva, GI Sterol 14?-Demethylase Structure-Based Optimization of Drug Candidates for Human Infections with the Protozoan Trypanosomatidae. J Med Chem 61:10910-10921 (2018)  
Target
Name:
Sterol 14-alpha demethylase
Synonyms:
CP51_TRYCC Cytochrome P450 51 Sterol 14α-demethylase (CYP51) Sterol 14-alpha demethylase (CYP51) | Tc14DM
Type:
Protein
Mol. Mass.:
54690.12
Organism:
Trypanosoma cruzi
Description:
Q7Z1V1
Residue:
481
  
Inhibitor
Name:
BDBM50276214
Synonyms:
CHEMBL4129161
Type:
Small organic molecule
Emp. Form.:
C26H17Cl2F2N5O2
Mol. Mass.:
540.348
SMILES:
Fc1ccc(cc1F)-c1nnc(o1)-c1ccc(cc1)C(=O)N[C@@H](Cn1ccnc1)c1ccc(Cl)cc1Cl
: