Target
Cysteinyl leukotriene receptor 1/2
Ligand
BDBM50057218
Substrate
Meas. Tech.
ChEMBL_52207 (CHEMBL664841)
Kd
45±n/a nM
Citation
 Zwaagstra, METimmerman, HTamura, MTohma, TWada, YOnogi, KZhang, MQ Synthesis and structure-activity relationships of carboxylated chalcones: a novel series of CysLT1 (LTD4) receptor antagonists. J Med Chem 40:1075-89 (1997)  
Target
Name:
Cysteinyl leukotriene receptor 1/2
Synonyms:
Cysteinyl leukotriene receptor
Type:
Mol. Mass.:
Description:
ASSAY_ID of ChEMBL is 98640
Components:
This complex has 2 components.
Component 1
Name:
Cysteinyl leukotriene receptor 1
Synonyms:
CLTR1_HUMAN CYSLTR1 Cysteinyl leukotriene receptor HG55 LTD4 receptor | Leukotriene Cysteinyl 1
Type:
Enzyme Catalytic Domain
Mol. Mass.:
38565.16
Organism:
Homo sapiens (Human)
Description:
Leukotriene Cysteinyl 1 CYSLTR1 HUMAN::Q9Y271
Residue:
337
  
Component 2
Name:
Cysteinyl leukotriene receptor 2
Synonyms:
CLTR2_HUMAN CYSLT2R Cysteinyl leukotriene receptor Leukotriene Cysteinyl 2
Type:
Enzyme Catalytic Domain
Mol. Mass.:
39657.52
Organism:
Homo sapiens (Human)
Description:
Leukotriene Cysteinyl 2 CYSLTR2 HUMAN::Q9NS75
Residue:
346
  
Inhibitor
Name:
BDBM50057218
Synonyms:
(E)-1-[2-Hydroxy-5-(1H-tetrazol-5-ylmethoxy)-phenyl]-3-[3-((E)-2-quinolin-2-yl-vinyl)-phenyl]-propenone CHEMBL11870
Type:
Small organic molecule
Emp. Form.:
C28H21N5O3
Mol. Mass.:
475.498
SMILES:
Oc1ccc(OCc2nnn[nH]2)cc1C(=O)C=Cc1cccc(C=Cc2ccc3ccccc3n2)c1
: