Target
Substance-K receptor
Ligand
BDBM50472911
Substrate
Meas. Tech.
ChEMBL_216604 (CHEMBL819176)
Kd
4.4±n/a nM
Citation
 Giannotti, DPerrotta, EDi Bugno, CNannicini, RHarmat, NJGiolitti, APatacchini, RRenzetti, ARRotondaro, LGiuliani, SAltamura, MMaggi, CA Discovery of potent cyclic pseudopeptide human tachykinin NK-2 receptor antagonists. J Med Chem 43:4041-4 (2000)  
Target
Name:
Substance-K receptor
Synonyms:
NK-2 receptor NK2R NKNAR Neurokinin A receptor Neurokinin-2 (NK-2) SKR TACR2 Tachykinin receptor 2 (NK2) | hnk-3
Type:
Protein
Mol. Mass.:
44455.78
Organism:
Homo sapiens (Human)
Description:
P21452
Residue:
398
  
Inhibitor
Name:
BDBM50472911
Synonyms:
CHEMBL407782 | MEN-11420
Type:
Small organic molecule
Emp. Form.:
C46H60N10O13
Mol. Mass.:
961.0278
SMILES:
[H][C@]12CNC(=O)C[C@]([H])(NC(=O)[C@H](CC(=O)N[C@@H]3O[C@H](CO)[C@@H](O)[C@H](CO)[C@H]3NC(C)=O)NC(=O)[C@H](CC(C)C)NC1=O)C(=O)N[C@@H](Cc1c[nH]c3ccccc13)C(=O)N[C@@H](Cc1ccccc1)C(=O)N2
: