Target
Dipeptidyl peptidase 4
Ligand
BDBM50478410
Substrate
Meas. Tech.
ChEMBL_550650 (CHEMBL1002745)
IC50
22.0±n/a nM
Citation
 Abe, MAkiyama, TNakamura, HKojima, FHarada, SMuraoka, Y First synthesis and determination of the absolute configuration of sulphostin, a novel inhibitor of dipeptidyl peptidase IV. J Nat Prod 67:999-1004 (2004)  
Target
Name:
Dipeptidyl peptidase 4
Synonyms:
Bile canaliculus domain-specific membrane glycoprotein Cd26 DPP4_RAT Dipeptidyl peptidase 4 Dipeptidyl peptidase 4 60 kDa soluble form Dipeptidyl peptidase 4 soluble form Dipeptidyl peptidase IV 60 kDa soluble form Dipeptidyl peptidase IV soluble form GP110 glycoprotein | T-cell activation antigen CD26
Type:
Enzyme
Mol. Mass.:
88084.94
Organism:
Rattus norvegicus (rat)
Description:
Residue:
767
  
Inhibitor
Name:
BDBM50478410
Synonyms:
CHEMBL504823
Type:
Small organic molecule
Emp. Form.:
C5H13N4O5PS
Mol. Mass.:
272.219
SMILES:
N[C@H]1CCCN(C1=O)[P@@](N)(=O)NS(O)(=O)=O
: