Target
Phenylethanolamine N-methyltransferase
Ligand
BDBM50029099
Substrate
Meas. Tech.
ChEMBL_152588 (CHEMBL759766)
Ki
59±n/a nM
Citation
 Bondinell, WEChapin, FWGirard, GRKaiser, CKrog, AJPavloff, AMSchwartz, MSSilvestri, JSVaidya, PDLam, BLWellman, GRPendleton, RG Inhibitors of phenylethanolamine N-methyltransferase and epinephrine biosynthesis. 1. Chloro-substituted 1,2,3,4-tetrahydroisoquinolines. J Med Chem 23:506-11 (1980)  
Target
Name:
Phenylethanolamine N-methyltransferase
Synonyms:
Noradrenaline N-methyltransferase PNMT PNMTase | Phenylethanolamine N-Methyltransferase (PNMT)
Type:
Enzyme
Mol. Mass.:
30852.66
Organism:
Homo sapiens (Human)
Description:
Residue:
282
  
Inhibitor
Name:
BDBM50029099
Synonyms:
5,7,8-Trichloro-1,2,3,4-tetrahydro-isoquinoline | CHEMBL149535
Type:
Small organic molecule
Emp. Form.:
C9H8Cl3N
Mol. Mass.:
236.526
SMILES:
Clc1cc(Cl)c2CCNCc2c1Cl
: