Target
Phenylethanolamine N-methyltransferase
Ligand
BDBM50029106
Substrate
Meas. Tech.
ChEMBL_152579 (CHEMBL759757)
IC50
600.0±n/a nM
Citation
 Bondinell, WEChapin, FWGirard, GRKaiser, CKrog, AJPavloff, AMSchwartz, MSSilvestri, JSVaidya, PDLam, BLWellman, GRPendleton, RG Inhibitors of phenylethanolamine N-methyltransferase and epinephrine biosynthesis. 1. Chloro-substituted 1,2,3,4-tetrahydroisoquinolines. J Med Chem 23:506-11 (1980)  
Target
Name:
Phenylethanolamine N-methyltransferase
Synonyms:
Noradrenaline N-methyltransferase PNMT PNMTase | Phenylethanolamine N-Methyltransferase (PNMT)
Type:
Enzyme
Mol. Mass.:
30852.66
Organism:
Homo sapiens (Human)
Description:
Residue:
282
  
Inhibitor
Name:
BDBM50029106
Synonyms:
2,3-Dichloro-benzylamine | CHEMBL13165
Type:
Small organic molecule
Emp. Form.:
C7H7Cl2N
Mol. Mass.:
176.043
SMILES:
NCc1cccc(Cl)c1Cl
: