Target
Structural capsid protein
Ligand
BDBM50486121
Substrate
Meas. Tech.
ChEMBL_885250 (CHEMBL2214223)
IC50
59±n/a nM
Citation
 Tremblay, MBonneau, PBousquet, YDeRoy, PDuan, JDuplessis, MGagnon, AGarneau, MGoudreau, NGuse, IHucke, OKawai, SHLemke, CTMason, SWSimoneau, BSurprenant, STitolo, SYoakim, C Inhibition of HIV-1 capsid assembly: optimization of the antiviral potency by site selective modifications at N1, C2 and C16 of a 5-(5-furan-2-yl-pyrazol-1-yl)-1H-benzimidazole scaffold. Bioorg Med Chem Lett 22:7512-7 (2012)  
Target
Name:
Structural capsid protein
Synonyms:
Structural capsid protein | gag
Type:
PROTEIN
Mol. Mass.:
12762.23
Organism:
Human immunodeficiency virus 1
Description:
ChEMBL_106648
Residue:
115
  
Inhibitor
Name:
BDBM50486121
Synonyms:
CHEMBL2204008
Type:
Small organic molecule
Emp. Form.:
C32H27F3N6O4
Mol. Mass.:
616.5898
SMILES:
CCc1cc(-c2ccc(o2)C(F)(F)F)n(n1)-c1ccc2n(Cc3ccc(=O)[nH]c3)c(nc2c1)-c1cc(ccc1O)C(=O)N(C)C
: