Target
Structural capsid protein
Ligand
BDBM50486132
Substrate
Meas. Tech.
ChEMBL_885252 (CHEMBL2214225)
IC50
88±n/a nM
Citation
 Tremblay, MBonneau, PBousquet, YDeRoy, PDuan, JDuplessis, MGagnon, AGarneau, MGoudreau, NGuse, IHucke, OKawai, SHLemke, CTMason, SWSimoneau, BSurprenant, STitolo, SYoakim, C Inhibition of HIV-1 capsid assembly: optimization of the antiviral potency by site selective modifications at N1, C2 and C16 of a 5-(5-furan-2-yl-pyrazol-1-yl)-1H-benzimidazole scaffold. Bioorg Med Chem Lett 22:7512-7 (2012)  
Target
Name:
Structural capsid protein
Synonyms:
Structural capsid protein | gag
Type:
PROTEIN
Mol. Mass.:
12762.23
Organism:
Human immunodeficiency virus 1
Description:
ChEMBL_106648
Residue:
115
  
Inhibitor
Name:
BDBM50486132
Synonyms:
CHEMBL2204002
Type:
Small organic molecule
Emp. Form.:
C32H28N4O6
Mol. Mass.:
564.5879
SMILES:
CCc1cc(-c2ccc(C)o2)n(n1)-c1ccc2n(Cc3ccc(OC)c(O)c3)c(nc2c1)-c1cc(ccc1O)C(O)=O
: