Target
Endothelin-1 receptor
Ligand
BDBM50407588
Substrate
Meas. Tech.
ChEMBL_65814 (CHEMBL679716)
IC50
6700±n/a nM
Citation
 Fukami, TNagase, TFujita, KHayama, TNiiyama, KMase, TNakajima, SFukuroda, TSaeki, TNishikibe, M Structure-activity relationships of cyclic pentapeptide endothelin A receptor antagonists. J Med Chem 38:4309-24 (1995)  
Target
Name:
Endothelin-1 receptor
Synonyms:
EDNRA Endothelin receptor ET-A
Type:
PROTEIN
Mol. Mass.:
48707.29
Organism:
Sus scrofa
Description:
ChEMBL_65803
Residue:
427
  
Inhibitor
Name:
BDBM50407588
Synonyms:
CHEMBL138067
Type:
Small organic molecule
Emp. Form.:
C30H40N6O7
Mol. Mass.:
596.6746
SMILES:
CC(C)C[C@H]1NC(=O)[C@@H](NC(=O)[C@H]2CCCN2C(=O)[C@@H](NC(=O)[C@H](Cc2c[nH]c3ccccc23)NC1=O)C(O)=O)C(C)C
: