Target
Substance-P receptor
Ligand
BDBM50033609
Substrate
Meas. Tech.
ChEBML_141662
IC50
54±n/a nM
Citation
 Hagiwara, DMiyake, HMurano, KMorimoto, HMurai, MFujii, TNakanishi, IMatsuo, M Studies on neurokinin antagonists. 3. Design and structure-activity relationships of new branched tripeptides N alpha-(substituted L-aspartyl, L-ornithyl, or L-lysyl)-N-methyl-N-(phenylmethyl)-L-phenylalaninamides as substance P antagonists. J Med Chem 36:2266-78 (1993)  
Target
Name:
Substance-P receptor
Synonyms:
NK1R_CAVPO Neurokinin NK1 TACR1
Type:
Enzyme Catalytic Domain
Mol. Mass.:
46261.42
Organism:
GUINEA PIG
Description:
Neurokinin NK1 TACR1 GUINEA PIG::P30547
Residue:
407
  
Inhibitor
Name:
BDBM50033609
Synonyms:
CHEMBL306267 | N*1*-[1-(Benzyl-methyl-carbamoyl)-2-phenyl-ethyl]-N*4*-(1-carbamoyl-2-hydroxy-propyl)-2-[(1H-indole-2-carbonyl)-amino]-succinamide
Type:
Small organic molecule
Emp. Form.:
C34H38N6O6
Mol. Mass.:
626.7021
SMILES:
C[C@@H](O)C(NC(=O)CC(NC(=O)c1cc2ccccc2[nH]1)C(=O)N[C@H](Cc1ccccc1)C(=O)N(C)Cc1ccccc1)C(N)=O
: