Target
Substance-P receptor
Ligand
BDBM50033610
Substrate
Meas. Tech.
ChEBML_141662
IC50
21±n/a nM
Citation
 Hagiwara, DMiyake, HMurano, KMorimoto, HMurai, MFujii, TNakanishi, IMatsuo, M Studies on neurokinin antagonists. 3. Design and structure-activity relationships of new branched tripeptides N alpha-(substituted L-aspartyl, L-ornithyl, or L-lysyl)-N-methyl-N-(phenylmethyl)-L-phenylalaninamides as substance P antagonists. J Med Chem 36:2266-78 (1993)  
Target
Name:
Substance-P receptor
Synonyms:
NK1R_CAVPO Neurokinin NK1 TACR1
Type:
Enzyme Catalytic Domain
Mol. Mass.:
46261.42
Organism:
GUINEA PIG
Description:
Neurokinin NK1 TACR1 GUINEA PIG::P30547
Residue:
407
  
Inhibitor
Name:
BDBM50033610
Synonyms:
1H-Indole-3-carboxylic acid {4-(2-acetylamino-3-hydroxy-butyrylamino)-1-[1-(benzyl-methyl-carbamoyl)-2-phenyl-ethylcarbamoyl]-butyl}-amide | CHEMBL308363
Type:
Small organic molecule
Emp. Form.:
C37H44N6O6
Mol. Mass.:
668.7819
SMILES:
C[C@@H](O)C(NC(C)=O)C(=O)NCCCC(NC(=O)c1c[nH]c2ccccc12)C(=O)N[C@H](Cc1ccccc1)C(=O)N(C)Cc1ccccc1
: