Target
Substance-P receptor
Ligand
BDBM50406796
Substrate
Meas. Tech.
ChEBML_141662
IC50
13±n/a nM
Citation
 Hagiwara, DMiyake, HMurano, KMorimoto, HMurai, MFujii, TNakanishi, IMatsuo, M Studies on neurokinin antagonists. 3. Design and structure-activity relationships of new branched tripeptides N alpha-(substituted L-aspartyl, L-ornithyl, or L-lysyl)-N-methyl-N-(phenylmethyl)-L-phenylalaninamides as substance P antagonists. J Med Chem 36:2266-78 (1993)  
Target
Name:
Substance-P receptor
Synonyms:
NK1R_CAVPO Neurokinin NK1 TACR1
Type:
Enzyme Catalytic Domain
Mol. Mass.:
46261.42
Organism:
GUINEA PIG
Description:
Neurokinin NK1 TACR1 GUINEA PIG::P30547
Residue:
407
  
Inhibitor
Name:
BDBM50406796
Synonyms:
CHEMBL2115161
Type:
Small organic molecule
Emp. Form.:
C38H46N6O6
Mol. Mass.:
682.8084
SMILES:
C[C@@H](O)[C@H](NC(C)=O)C(=O)NCCCC[C@H](NC(=O)c1c[nH]c2ccccc12)C(=O)N[C@H](Cc1ccccc1)C(=O)N(C)Cc1ccccc1
: