Target
Delta-type opioid receptor
Ligand
BDBM50036266
Substrate
Meas. Tech.
ChEMBL_146876 (CHEMBL750003)
IC50
730±n/a nM
Citation
 Lung, FDMeyer, JPLi, GLou, BSStropova, DDavis, PYamamura, HIPorreca, FHruby, VJ Highly kappa receptor-selective dynorphin A analogues with modifications in position 3 of dynorphin A(1-11)-NH2. J Med Chem 38:585-6 (1995)  
Target
Name:
Delta-type opioid receptor
Synonyms:
D-OR-1 Delta opioid receptor OPIATE Delta OPRD1 OPRK1 | opioid receptor, delta 1
Type:
G Protein-Coupled Receptor (GPCR)
Mol. Mass.:
40382.98
Organism:
Homo sapiens (Human)
Description:
Competition binding assays were carried out using membrane preparations from transfected HN9.10 cells that constitutively expressed the delta opioid receptor.
Residue:
372
  
Inhibitor
Name:
BDBM50036266
Synonyms:
CHEMBL262963 Dyn A(H-Tyr-Gly-D-Ala-Phe-Leu-Arg-Arg-Ile-Arg-Pro-Lys)-NH2 | Linear [Ala3]Dyn A-(1-11)NH2
Type:
Small organic molecule
Emp. Form.:
C64H106N22O12
Mol. Mass.:
1375.6666
SMILES:
CC[C@H](C)[C@H](NC(=O)[C@H](CCCNC(N)=N)NC(=O)[C@H](CCCNC(N)=N)NC(=O)[C@H](CC(C)C)NC(=O)[C@H](Cc1ccccc1)NC(=O)[C@H](C)NC(=O)CNC(=O)[C@@H](N)Cc1ccc(O)cc1)C(=O)N[C@@H](CCCNC(N)=N)C(=O)N1CCC[C@H]1C(=O)N[C@@H](CCCCN)C(N)=O
: