Target
Angiotensin-converting enzyme
Ligand
BDBM50041050
Substrate
Meas. Tech.
ChEMBL_36915 (CHEMBL647116)
IC50
210±n/a nM
Citation
 Fournié-Zaluski, MCCoric, PTurcaud, SRousselet, NGonzalez, WBarbe, BPham, IJullian, NMichel, JBRoques, BP New dual inhibitors of neutral endopeptidase and angiotensin-converting enzyme: rational design, bioavailability, and pharmacological responses in experimental hypertension. J Med Chem 37:1070-83 (1994)  
Target
Name:
Angiotensin-converting enzyme
Synonyms:
ACE_MOUSE Dcp1
Type:
PROTEIN
Mol. Mass.:
150916.88
Organism:
Mus musculus
Description:
ChEMBL_34763
Residue:
1312
  
Inhibitor
Name:
BDBM50041050
Synonyms:
3-(4-Hydroxy-phenyl)-2-(2-mercaptomethyl-3-o-tolyl-butyrylamino)-propionic acid | CHEMBL416522
Type:
Small organic molecule
Emp. Form.:
C21H25NO4S
Mol. Mass.:
387.493
SMILES:
CC(C(CS)C(=O)NC(Cc1ccc(O)cc1)C(O)=O)c1ccccc1C
: