Target
Angiotensin-converting enzyme
Ligand
BDBM50041060
Substrate
Meas. Tech.
ChEMBL_36915 (CHEMBL647116)
IC50
4±n/a nM
Citation
 Fournié-Zaluski, MCCoric, PTurcaud, SRousselet, NGonzalez, WBarbe, BPham, IJullian, NMichel, JBRoques, BP New dual inhibitors of neutral endopeptidase and angiotensin-converting enzyme: rational design, bioavailability, and pharmacological responses in experimental hypertension. J Med Chem 37:1070-83 (1994)  
Target
Name:
Angiotensin-converting enzyme
Synonyms:
ACE_MOUSE Dcp1
Type:
PROTEIN
Mol. Mass.:
150916.88
Organism:
Mus musculus
Description:
ChEMBL_34763
Residue:
1312
  
Inhibitor
Name:
BDBM50041060
Synonyms:
2-[3-(3,4-Dimethoxy-phenyl)-2-mercaptomethyl-butyrylamino]-3-(4-hydroxy-phenyl)-propionic acid | CHEMBL11806
Type:
Small organic molecule
Emp. Form.:
C22H27NO6S
Mol. Mass.:
433.518
SMILES:
COc1ccc(cc1OC)C(C)C(CS)C(=O)NC(Cc1ccc(O)cc1)C(O)=O
: