Target
Angiotensin-converting enzyme
Ligand
BDBM50041058
Substrate
Meas. Tech.
ChEMBL_36915 (CHEMBL647116)
IC50
9.5±n/a nM
Citation
 Fournié-Zaluski, MCCoric, PTurcaud, SRousselet, NGonzalez, WBarbe, BPham, IJullian, NMichel, JBRoques, BP New dual inhibitors of neutral endopeptidase and angiotensin-converting enzyme: rational design, bioavailability, and pharmacological responses in experimental hypertension. J Med Chem 37:1070-83 (1994)  
Target
Name:
Angiotensin-converting enzyme
Synonyms:
ACE_MOUSE Dcp1
Type:
PROTEIN
Mol. Mass.:
150916.88
Organism:
Mus musculus
Description:
ChEMBL_34763
Residue:
1312
  
Inhibitor
Name:
BDBM50041058
Synonyms:
2-(3-Benzo[1,3]dioxol-5-yl-2-mercaptomethyl-butyrylamino)-propionic acid | CHEMBL11620
Type:
Small organic molecule
Emp. Form.:
C15H19NO5S
Mol. Mass.:
325.38
SMILES:
CC(NC(=O)C(CS)C(C)c1ccc2OCOc2c1)C(O)=O
: