Target
Angiotensin-converting enzyme
Ligand
BDBM50041069
Substrate
Meas. Tech.
ChEMBL_36915 (CHEMBL647116)
IC50
25±n/a nM
Citation
 Fournié-Zaluski, MCCoric, PTurcaud, SRousselet, NGonzalez, WBarbe, BPham, IJullian, NMichel, JBRoques, BP New dual inhibitors of neutral endopeptidase and angiotensin-converting enzyme: rational design, bioavailability, and pharmacological responses in experimental hypertension. J Med Chem 37:1070-83 (1994)  
Target
Name:
Angiotensin-converting enzyme
Synonyms:
ACE_MOUSE Dcp1
Type:
PROTEIN
Mol. Mass.:
150916.88
Organism:
Mus musculus
Description:
ChEMBL_34763
Residue:
1312
  
Inhibitor
Name:
BDBM50041069
Synonyms:
3-(4-Hydroxy-phenyl)-2-(2-mercaptomethyl-3-phenyl-propionylamino)-propionic acid | CHEMBL11495
Type:
Small organic molecule
Emp. Form.:
C19H21NO4S
Mol. Mass.:
359.439
SMILES:
OC(=O)C(Cc1ccc(O)cc1)NC(=O)C(CS)Cc1ccccc1
: