Target
Angiotensin-converting enzyme
Ligand
BDBM50041065
Substrate
Meas. Tech.
ChEMBL_36915 (CHEMBL647116)
IC50
100±n/a nM
Citation
 Fournié-Zaluski, MCCoric, PTurcaud, SRousselet, NGonzalez, WBarbe, BPham, IJullian, NMichel, JBRoques, BP New dual inhibitors of neutral endopeptidase and angiotensin-converting enzyme: rational design, bioavailability, and pharmacological responses in experimental hypertension. J Med Chem 37:1070-83 (1994)  
Target
Name:
Angiotensin-converting enzyme
Synonyms:
ACE_MOUSE Dcp1
Type:
PROTEIN
Mol. Mass.:
150916.88
Organism:
Mus musculus
Description:
ChEMBL_34763
Residue:
1312
  
Inhibitor
Name:
BDBM50041065
Synonyms:
2-(2-Mercaptomethyl-3-phenyl-butyrylamino)-3-methyl-butyric acid | CHEMBL275980
Type:
Small organic molecule
Emp. Form.:
C16H23NO3S
Mol. Mass.:
309.424
SMILES:
CC(C)C(NC(=O)C(CS)C(C)c1ccccc1)C(O)=O
: