Target
Angiotensin-converting enzyme
Ligand
BDBM50041068
Substrate
Meas. Tech.
ChEMBL_36915 (CHEMBL647116)
IC50
7.9±n/a nM
Citation
 Fournié-Zaluski, MCCoric, PTurcaud, SRousselet, NGonzalez, WBarbe, BPham, IJullian, NMichel, JBRoques, BP New dual inhibitors of neutral endopeptidase and angiotensin-converting enzyme: rational design, bioavailability, and pharmacological responses in experimental hypertension. J Med Chem 37:1070-83 (1994)  
Target
Name:
Angiotensin-converting enzyme
Synonyms:
ACE_MOUSE Dcp1
Type:
PROTEIN
Mol. Mass.:
150916.88
Organism:
Mus musculus
Description:
ChEMBL_34763
Residue:
1312
  
Inhibitor
Name:
BDBM50041068
Synonyms:
3-(4-Hydroxy-phenyl)-2-[3-(4-hydroxy-phenyl)-2-mercaptomethyl-butyrylamino]-propionic acid | CHEMBL11227
Type:
Small organic molecule
Emp. Form.:
C20H23NO5S
Mol. Mass.:
389.465
SMILES:
CC(C(CS)C(=O)NC(Cc1ccc(O)cc1)C(O)=O)c1ccc(O)cc1
: