Target
Angiotensin-converting enzyme
Ligand
BDBM50041057
Substrate
Meas. Tech.
ChEMBL_36915 (CHEMBL647116)
IC50
4.5±n/a nM
Citation
 Fournié-Zaluski, MCCoric, PTurcaud, SRousselet, NGonzalez, WBarbe, BPham, IJullian, NMichel, JBRoques, BP New dual inhibitors of neutral endopeptidase and angiotensin-converting enzyme: rational design, bioavailability, and pharmacological responses in experimental hypertension. J Med Chem 37:1070-83 (1994)  
Target
Name:
Angiotensin-converting enzyme
Synonyms:
ACE_MOUSE Dcp1
Type:
PROTEIN
Mol. Mass.:
150916.88
Organism:
Mus musculus
Description:
ChEMBL_34763
Residue:
1312
  
Inhibitor
Name:
BDBM50041057
Synonyms:
2-[3-(3,4-Difluoro-phenyl)-2-mercaptomethyl-butyrylamino]-3-(4-hydroxy-phenyl)-propionic acid | CHEMBL11607
Type:
Small organic molecule
Emp. Form.:
C20H21F2NO4S
Mol. Mass.:
409.447
SMILES:
CC(C(CS)C(=O)NC(Cc1ccc(O)cc1)C(O)=O)c1ccc(F)c(F)c1
: