Target
Angiotensin-converting enzyme
Ligand
BDBM50041059
Substrate
Meas. Tech.
ChEMBL_36915 (CHEMBL647116)
IC50
19±n/a nM
Citation
 Fournié-Zaluski, MCCoric, PTurcaud, SRousselet, NGonzalez, WBarbe, BPham, IJullian, NMichel, JBRoques, BP New dual inhibitors of neutral endopeptidase and angiotensin-converting enzyme: rational design, bioavailability, and pharmacological responses in experimental hypertension. J Med Chem 37:1070-83 (1994)  
Target
Name:
Angiotensin-converting enzyme
Synonyms:
ACE_MOUSE Dcp1
Type:
PROTEIN
Mol. Mass.:
150916.88
Organism:
Mus musculus
Description:
ChEMBL_34763
Residue:
1312
  
Inhibitor
Name:
BDBM50041059
Synonyms:
2-(2-Mercaptomethyl-3-phenyl-butyrylamino)-4-methyl-pentanoic acid | CHEMBL273898
Type:
Small organic molecule
Emp. Form.:
C17H25NO3S
Mol. Mass.:
323.45
SMILES:
CC(C)CC(NC(=O)C(CS)C(C)c1ccccc1)C(O)=O
: