Target
Diacylglycerol O-acyltransferase 2
Ligand
BDBM360598
Substrate
Meas. Tech.
ChEMBL_1538840 (CHEMBL3737415)
IC50
120±n/a nM
Citation
 Imbriglio, JEShen, DMLiang, RMarby, KYou, MYoum, HWFeng, ZLondon, CXiong, YTata, JVerras, AGarcia-Calvo, MSong, XAddona, GHMcLaren, DGHe, TMurphy, BMetzger, DESalituro, GDeckman, DChen, QJin, XStout, SJWang, SPWilsie, LPalyha, OHan, SHubbard, BKPrevis, SFPinto, STaggart, A Discovery and Pharmacology of a Novel Class of Diacylglycerol Acyltransferase 2 Inhibitors. J Med Chem 58:9345-53 (2015)  
Target
Name:
Diacylglycerol O-acyltransferase 2
Synonyms:
ARAT DGAT2 Diacylglycerol O-acyltransferase 2 (DGAT2) Retinol O-fatty-acyltransferase
Type:
Multi-pass membrane protein
Mol. Mass.:
43848.90
Organism:
Homo sapiens (Human)
Description:
Q96PD7
Residue:
388
  
Inhibitor
Name:
BDBM360598
Synonyms:
US9828369, Example 155 | methyl 3-(8-((3-(2,3- dichlorophenyl)ureido)methyl)isoquinolin- 5-yl)benzoate
Type:
Small organic molecule
Emp. Form.:
C25H19Cl2N3O3
Mol. Mass.:
480.343
SMILES:
COC(=O)c1cccc(c1)-c1ccc(CNC(=O)Nc2cccc(Cl)c2Cl)c2cnccc12
: