Target
Alpha-1,6-mannosyl-glycoprotein 2-beta-N-acetylglucosaminyltransferase
Ligand
BDBM50499294
Substrate
Meas. Tech.
ChEMBL_1538841 (CHEMBL3737416)
IC50
16000±n/a nM
Citation
 Imbriglio, JEShen, DMLiang, RMarby, KYou, MYoum, HWFeng, ZLondon, CXiong, YTata, JVerras, AGarcia-Calvo, MSong, XAddona, GHMcLaren, DGHe, TMurphy, BMetzger, DESalituro, GDeckman, DChen, QJin, XStout, SJWang, SPWilsie, LPalyha, OHan, SHubbard, BKPrevis, SFPinto, STaggart, A Discovery and Pharmacology of a Novel Class of Diacylglycerol Acyltransferase 2 Inhibitors. J Med Chem 58:9345-53 (2015)  
Target
Name:
Alpha-1,6-mannosyl-glycoprotein 2-beta-N-acetylglucosaminyltransferase
Synonyms:
2.4.1.143 GNT-II MGAT2 Mannoside acetylglucosaminyltransferase 2 Monoacylglycerol acyltransferase type 2 (h-MGAT2) h-MGAT2 (human monoacylglycerol acyltransferase type 2)
Type:
Mol. Mass.:
51567.80
Organism:
Homo sapiens (Human)
Description:
Q10469
Residue:
447
  
Inhibitor
Name:
BDBM50499294
Synonyms:
CHEMBL3735953
Type:
Small organic molecule
Emp. Form.:
C17H16N2O
Mol. Mass.:
264.3217
SMILES:
COc1cccc(c1)-c1ccc(CN)c2cnccc12
: