Target
Thymidylate synthase
Ligand
BDBM50011244
Substrate
Meas. Tech.
ChEMBL_209646 (CHEMBL811587)
Ki
12.0±n/a nM
Citation
 Jones, TRWebber, SEVarney, MDReddy, MRLewis, KKKathardekar, VMazdiyasni, HDeal, JNguyen, DWelsh, KMWebber, SJohnston, AMatthews, DASmith, WWJanson, CABacquet, RJHowland, EFBooth, CLHerrmann, SMWard, RWWhite, JBartlett, CAMorse, CA Structure-based design of substituted diphenyl sulfones and sulfoxides as lipophilic inhibitors of thymidylate synthase. J Med Chem 40:677-83 (1997)  
Target
Name:
Thymidylate synthase
Synonyms:
TS TYMS Thymidylate synthase (TS) | Thymidylate synthase/GAR transformylase/AICAR transformylase
Type:
Enzyme
Mol. Mass.:
35718.07
Organism:
Homo sapiens (Human)
Description:
Residue:
313
  
Inhibitor
Name:
BDBM50011244
Synonyms:
6-{[(4-Benzenesulfonyl-phenyl)-prop-2-ynyl-amino]-methyl}-2-methyl-3H-quinazolin-4-one | CHEMBL417222
Type:
Small organic molecule
Emp. Form.:
C25H21N3O3S
Mol. Mass.:
443.518
SMILES:
Cc1nc2ccc(CN(CC#C)c3ccc(cc3)S(=O)(=O)c3ccccc3)cc2c(=O)[nH]1
: