Target
Proto-oncogene tyrosine-protein kinase Src
Ligand
BDBM50064834
Substrate
Meas. Tech.
ChEMBL_216865 (CHEMBL816864)
IC50
540±n/a nM
Citation
 Alfaro-Lopez, JYuan, WPhan, BCKamath, JLou, QLam, KSHruby, VJ Discovery of a novel series of potent and selective substrate-based inhibitors of p60c-src protein tyrosine kinase: conformational and topographical constraints in peptide design. J Med Chem 41:2252-60 (1998)  
Target
Name:
Proto-oncogene tyrosine-protein kinase Src
Synonyms:
Calmodulin/Proto-oncogene tyrosine-protein kinase Src Proto-oncogene c-Src SRC SRC_HUMAN V-src sarcoma (Schmidt-Ruppin A-2) viral oncogene homolog (avian) p60-Src | pp60c-src
Type:
Protein
Mol. Mass.:
59838.60
Organism:
Homo sapiens (Human)
Description:
P12931
Residue:
536
  
Inhibitor
Name:
BDBM50064834
Synonyms:
CHEMBL216490 | Y-c[D-Pen-(3,5-diI)Tyr-GSFC]KR-NH2
Type:
Small organic molecule
Emp. Form.:
C52H72I2N14O12S2
Mol. Mass.:
1403.154
SMILES:
CC1(C)SSC[C@@H](NC(=O)[C@@H](Cc2ccccc2)NC(=O)[C@H](CO)NC(=O)CNC(=O)[C@H](Cc2cc(I)c(O)c(I)c2)NC(=O)[C@@H]1NC(=O)[C@@H](N)Cc1ccc(O)cc1)C(=O)N[C@@H](CCCCN)C(=O)N[C@@H](CCCNC(N)=N)C(N)=O
: