Target
Plasminogen
Ligand
BDBM50514075
Substrate
Meas. Tech.
ChEMBL_1855589 (CHEMBL4356318)
IC50
8.6±n/a nM
Citation
 Steinmetzer, TPilgram, OWenzel, BMWiedemeyer, SJA Fibrinolysis Inhibitors: Potential Drugs for the Treatment and Prevention of Bleeding. J Med Chem 63:1445-1472 (2020)  
Target
Name:
Plasminogen
Synonyms:
Activation peptide PLG Plasmin Plasmin heavy chain A, short form | Plasmin light chain B
Type:
Enzyme
Mol. Mass.:
90579.18
Organism:
Homo sapiens (Human)
Description:
Residue:
810
  
Inhibitor
Name:
BDBM50514075
Synonyms:
CHEMBL4541084
Type:
Small organic molecule
Emp. Form.:
C33H38N8O4
Mol. Mass.:
610.706
SMILES:
CCOC(=O)c1ccc(c(C)n1)-c1ccc(C[C@H](NC(=O)[C@H]2CC[C@H](CN)CC2)C(=O)Nc2ccc(cc2)-c2nn[nH]n2)cc1
: