Target
Prothrombin
Ligand
BDBM108098
Substrate
Meas. Tech.
ChEMBL_1855621 (CHEMBL4356350)
Ki
>1000±n/a nM
Citation
 Steinmetzer, TPilgram, OWenzel, BMWiedemeyer, SJA Fibrinolysis Inhibitors: Potential Drugs for the Treatment and Prevention of Bleeding. J Med Chem 63:1445-1472 (2020)  
Target
Name:
Prothrombin
Synonyms:
Activation peptide fragment 1 Coagulation factor II Prothrombin precursor Thrombin heavy chain | Thrombin light chain
Type:
Protein
Mol. Mass.:
70029.57
Organism:
Homo sapiens (Human)
Description:
P00734
Residue:
622
  
Inhibitor
Name:
BDBM108098
Synonyms:
US8598206, Table 6, 7
Type:
Small organic molecule
Emp. Form.:
C37H53N7O5S
Mol. Mass.:
707.926
SMILES:
NC(=N)c1ccc(CNC(=O)[C@H](CCC2CCNCC2)NC(=O)[C@@H](CCC2CCN(CC2)C(=O)C2CC2)NS(=O)(=O)Cc2ccccc2)cc1
: