Target
Plasminogen
Ligand
BDBM50514062
Substrate
Meas. Tech.
ChEMBL_1855589 (CHEMBL4356318)
IC50
0.400000±n/a nM
Citation
 Steinmetzer, TPilgram, OWenzel, BMWiedemeyer, SJA Fibrinolysis Inhibitors: Potential Drugs for the Treatment and Prevention of Bleeding. J Med Chem 63:1445-1472 (2020)  
Target
Name:
Plasminogen
Synonyms:
Activation peptide PLG Plasmin Plasmin heavy chain A, short form | Plasmin light chain B
Type:
Enzyme
Mol. Mass.:
90579.18
Organism:
Homo sapiens (Human)
Description:
Residue:
810
  
Inhibitor
Name:
BDBM50514062
Synonyms:
CHEMBL4436082
Type:
Small organic molecule
Emp. Form.:
C34H37ClN8O3
Mol. Mass.:
641.162
SMILES:
Cc1nc2[nH]c(nc2cc1-c1ccc(C[C@H](NC(=O)[C@H]2CC[C@H](CN)CC2)C(=O)Nc2cc(Cl)c3[nH]c(=O)[nH]c3c2)cc1)C1CC1
: