Target
Plasminogen
Ligand
BDBM50357211
Substrate
Meas. Tech.
ChEMBL_1855575 (CHEMBL4356304)
Kd
9000±n/a nM
Citation
 Steinmetzer, TPilgram, OWenzel, BMWiedemeyer, SJA Fibrinolysis Inhibitors: Potential Drugs for the Treatment and Prevention of Bleeding. J Med Chem 63:1445-1472 (2020)  
Target
Name:
Plasminogen
Synonyms:
Activation peptide PLG Plasmin Plasmin heavy chain A, short form | Plasmin light chain B
Type:
Enzyme
Mol. Mass.:
90579.18
Organism:
Homo sapiens (Human)
Description:
Residue:
810
  
Inhibitor
Name:
BDBM50357211
Synonyms:
177 J.D. Amicar | Aminocaproic
Type:
Small organic molecule
Emp. Form.:
C6H13NO2
Mol. Mass.:
131.1729
SMILES:
NCCCCCC(O)=O
: