Target
Plasminogen
Ligand
BDBM50514078
Substrate
Meas. Tech.
ChEMBL_1855589 (CHEMBL4356318)
IC50
2.1±n/a nM
Citation
 Steinmetzer, TPilgram, OWenzel, BMWiedemeyer, SJA Fibrinolysis Inhibitors: Potential Drugs for the Treatment and Prevention of Bleeding. J Med Chem 63:1445-1472 (2020)  
Target
Name:
Plasminogen
Synonyms:
Activation peptide PLG Plasmin Plasmin heavy chain A, short form | Plasmin light chain B
Type:
Enzyme
Mol. Mass.:
90579.18
Organism:
Homo sapiens (Human)
Description:
Residue:
810
  
Inhibitor
Name:
BDBM50514078
Synonyms:
CHEMBL4582882
Type:
Small organic molecule
Emp. Form.:
C35H35ClN6O6
Mol. Mass.:
671.142
SMILES:
Cc1cc2c(cc1-c1ccc(C[C@H](NC(=O)[C@H]3CC[C@H](CN)CC3)C(=O)Nc3cc(Cl)c4[nH]c(=O)[nH]c4c3)cc1)[nH]cc(C(O)=O)c2=O
: