Target
Prostaglandin G/H synthase 1
Ligand
BDBM22369
Substrate
Meas. Tech.
ChEMBL_158916 (CHEMBL873629)
IC50
19000±n/a nM
Citation
 Leblanc, YRoy, PBoyce, SBrideau, CChan, CCCharleson, SGordon, RGrimm, EGuay, JLéger, SLi, CSRiendeau, DVisco, DWang, ZWebb, JXu, LJPrasit, P SAR in the alkoxy lactone series: the discovery of DFP, a potent and orally active COX-2 inhibitor. Bioorg Med Chem Lett 9:2207-12 (1999)  
Target
Name:
Prostaglandin G/H synthase 1
Synonyms:
COX-1 Cyclooxygenase Cyclooxygenase-1 (COX-1) PTGS1 | Prostaglandin G/H synthase (cyclooxygenase)
Type:
Enzyme
Mol. Mass.:
68692.62
Organism:
Homo sapiens (Human)
Description:
P23219
Residue:
599
  
Inhibitor
Name:
BDBM22369
Synonyms:
4-(4-methanesulfonylphenyl)-3-phenyl-2,5-dihydrofuran-2-one MK 0966 US11478464, Compound Rofecoxib | US11786535, Compound Rofecoxib
Type:
Small organic molecule
Emp. Form.:
C17H14O4S
Mol. Mass.:
314.356
SMILES:
CS(=O)(=O)c1ccc(cc1)C1=C(C(=O)OC1)c1ccccc1
: