Target
Protein farnesyltransferase subunit beta/geranylgeranyltransferase type-1 subunit alpha
Ligand
BDBM50080748
Substrate
Meas. Tech.
ChEMBL_70270 (CHEMBL681409)
IC50
0.2±n/a nM
Citation
 O'Connor, SJBarr, KJWang, LSorensen, BKTasker, ASSham, HNg, SCCohen, JDevine, ECherian, SSaeed, BZhang, HLee, JYWarner, RTahir, SKovar, PEwing, PAlder, JMitten, MLeal, JMarsh, KBauch, JHoffman, DJSebti, SMRosenberg, SH Second-generation peptidomimetic inhibitors of protein farnesyltransferase demonstrating improved cellular potency and significant in vivo efficacy. J Med Chem 42:3701-10 (1999)  
Target
Name:
Protein farnesyltransferase subunit beta/geranylgeranyltransferase type-1 subunit alpha
Synonyms:
Protein Farnesyltransferase (PFT) | Protein farnesyltransferase
Type:
Protein Complex
Mol. Mass.:
Description:
Purified bovine brain FTase.
Components:
This complex has 2 components.
Component 1
Name:
Protein farnesyltransferase/geranylgeranyltransferase type-1 subunit alpha
Synonyms:
CAAX farnesyltransferase alpha subunit FNTA_BOVIN GGTase-I-alpha Protein Farnesyltransferase (PFT) Chain A Protein farnesyltransferase/geranylgeranyltransferase type I alpha subunit Type I protein geranyl-geranyltransferase alpha subunit
Type:
Enzyme
Mol. Mass.:
43827.38
Organism:
Bos taurus (bovine)
Description:
The enzyme was purified from a bovine brain homogenate by sequential ammonium sulfate fractionation and affinity chromatography.
Residue:
375
  
Component 2
Name:
Protein farnesyltransferase subunit beta
Synonyms:
CAAX farnesyltransferase subunit beta FNTB_BOVIN Protein farnesyltransferase Protein farnesyltransferase subunit beta Ras proteins prenyltransferase subunit beta
Type:
Enzyme Subunit
Mol. Mass.:
48758.49
Organism:
Bos taurus (bovine)
Description:
Protein farnesyltransferase subunit beta
Residue:
437
  
Inhibitor
Name:
BDBM50080748
Synonyms:
(S)-2-[(5-{[(3,5-Difluoro-benzyl)-thiazol-5-ylmethyl-amino]-methyl}-2'-methyl-biphenyl-2-carbonyl)-amino]-4-methylsulfanyl-butyric acid | CHEMBL122678
Type:
Small organic molecule
Emp. Form.:
C31H31F2N3O3S2
Mol. Mass.:
595.723
SMILES:
CSCC[C@H](NC(=O)c1ccc(CN(Cc2cncs2)Cc2cc(F)cc(F)c2)cc1-c1ccccc1C)C(O)=O
: